Ontologia Regione Veneto: Ontologia della Cultura in Veneto
type: Ontology
creator: Regione Veneto
date: 2018-08-30
description: L'Ontologia Regione Veneto descrive la struttura concettuale dei dati provenienti dalle diverse fonti relative alla cultura in Veneto. Nel modello è stato incluso il Catalogo dei Beni Culturali, i luoghi e gli eventi della cultura della regione, i musei e le biblioteche. I beni culturali, gli eventi e i luoghi della cultura sono stati corredati di informazioni relative alle sedi fisiche che li ospitano e agli intervalli temporali relativi, rendendo possibile una esplorazione del patrimonio culturale della regione su base geografica e temporale.
modified: 2018-08-30
comment: L'Ontologia Regione Veneto descrive la struttura concettuale dei dati provenienti dalle diverse fonti relative alla cultura in Veneto. Nel modello è stato incluso il Catalogo dei Beni Culturali, contenente le architetture, le opere d'arte, i reperti archeologici, i beni botanici e le fotografie. Sono anche stati modellati i luoghi e gli eventi della cultura della regione, inclusi i musei e le biblioteche. L'Ontologia Regione Veneto è stata allineata all'ontologia cidoc-CRM e all'ontologia Cultural-ON.
version IRI: cbcv:1.0
version info: Versione 1.0 - 30 Agosto 2018

appartieneAllaRete
type: ObjectProperty
domain: Biblioteca
range: Rete bibliotecaria
comment: Proprietà che lega la biblioteca alla sua rete bibliotecaria di appartenenza.

collocazione di
type: ObjectProperty
domain: Class
  union of: Bene Culturale
  union of: Bene Naturalistico
  union of: Biblioteca
  union of: Museo
range: Class
  union of: Bene Culturale
  union of: Collocazione specifica
  union of: Documento audio
  union of: Documento video
comment: Proprietà che lega un bene culturale alla sua locazione specifica.

haAutore
type: ObjectProperty
domain: Bene Culturale
range: Autore
comment: Proprietà che lega l'autore al bene culturale che ha realizzato.

haCodiceBene
type: ObjectProperty
sub property of: P48 has preferred identifier
domain: Class
  union of: Bene Culturale
  union of: Bene Naturalistico
range: Codici
comment: Proprietà che lega il bene catalogato al relativo codice univoco.

haCodiceEvento
type: ObjectProperty
sub property of: P48 has preferred identifier
domain: Evento culturale
range: Codici
comment: Proprietà che lega l'evento culturale al relativo codice univoco.

ha codice infrastruttura
type: ObjectProperty
domain: Infrastruttura
range: Codici
comment: Proprietà che lega l'infrastruttura al relativo codice univoco.

haCollaboratore
type: ObjectProperty
domain: Bene Culturale
range: Collaboratore
comment: Proprietà che lega un collaboratore al bene culturale a cui è legato.

ha collana editoriale
type: ObjectProperty
domain: Libro
range: Collana Editoriale
comment: Proprietà che collega un libro ad una collana editoriale.

haCollocazione
type: ObjectProperty
sub property of: P55 has current location
domain: Class
  union of: Bene Culturale
  union of: Bene Naturalistico
  union of: Documento audio
  union of: Documento video
range: Class
  union of: Bene Culturale
  union of: Biblioteca
  union of: Collocazione specifica
  union of: Museo
comment: Proprietà che lega un bene culturale alla sua collocazione specifica.

haColore
type: ObjectProperty
domain: Class
  union of: Bene Culturale
  union of: Bene Naturalistico
range: Colore
comment: Indicazione di colore dell'opera.
sub property of: cidoc:P56_bears_feature

haComune
type: ObjectProperty
sub property of: hasCity
domain: Thing
range: Comune
comment: Proprietà che identifica il comune di appartenenza di una entità.

haContatti
type: ObjectProperty
domain: Class
  union of: Biblioteca
  union of: Evento culturale
  union of: Museo
range: Contatti
comment: Proprietà che lega il museo, la biblioteca o l'evento ai relativi contatti.

haContenitore
type: ObjectProperty
sub property of: P87 is identified by
domain: Collocazione specifica
range: Nome collocazione specifica
comment: Proprietà che indica il nome proprio completo o la denominazione corrente o il titolo del contenitore.

haDocumentoAudio
type: ObjectProperty
domain: Bene Culturale
range: Documento audio
comment: Proprietà che lega il bene alla sua documentazione audio.

haDocumentoVideo
type: ObjectProperty
domain: Bene Culturale
range: Documento video
comment: Proprietà che lega il bene alla sua documentazione video.

haEditore
type: ObjectProperty
domain: Bene Culturale
range: Editore
comment: Proprietà che lega l'editore al bene culturale che ha pubblicato.

haEventoConnesso
type: ObjectProperty
domain: Class
  union of: Evento culturale
  union of: Infrastruttura
range: Evento culturale
comment: Proprietà che lega un evento o un'infrastruttura ad un evento ad esso collegato.

ha geometria
type: ObjectProperty
domain: Geometria
domain: Thing
range: Geometria
range: Tipo geometria
comment: Proprietà che collega la geometria al suo tipo (poligono, punto, linea).
comment: Proprietà che collega una qualsisasi cosa alla sua geometria.
label: ha tipo geometria

haIndirizzo
type: ObjectProperty
domain: Thing
range: Indirizzo
comment: Proprietà che individua l'indirizzo di una entità.

ha infrastruttura connessa
type: ObjectProperty
domain: Class
  union of: Evento culturale
  union of: Infrastruttura
range: Infrastruttura
comment: Proprietà che lega un evento o un'infrastruttura ad una infrastruttura ad essi collegata.

ha orari intervallo temporale
type: ObjectProperty
domain: Thing
range: Intervallo termporale
comment: Proprietà che collega qualcosa at proprio intervallo temporale.

haLocalita
type: ObjectProperty
sub property of: hasAddressArea
domain: Thing
range: Localita
comment: Proprietà che identifica la località di appartenenza di una entità.

haLocation
type: ObjectProperty
domain: Evento culturale
range: Class
  union of: Luogo evento culturale
  union of: Museo
comment: Proprietà che lega un evento al luogo in cui si svolge

ha orari di apertura
type: ObjectProperty
domain: Thing
range: OrariDiApertura
comment: Proprietà che collega qualcosa ai propri orari di apertura.

haProgetto
type: ObjectProperty
domain: Biblioteca
range: Progetto biblioteca
comment: Proprietà che lega la biblioteca al progetto.

ha situazione giuridica
type: ObjectProperty
domain: SituazioneGiuridica
range: Agente
comment: Proprietà che collega una situazione giuridica al proprietario.

haProvincia
type: ObjectProperty
sub property of: hasProvince
domain: Thing
range: Provincia
comment: Proprietà che lega un bene culturale alla sua provincia.

haRegione
type: ObjectProperty
sub property of: hasRegion
domain: Thing
range: Regione
comment: Proprietà che lega un bene culturale alla sua regione.

haServizio
type: ObjectProperty
domain: Class
  union of: Biblioteca
  union of: Museo
range: Servizio
comment: Proprietà che lega una struttura ai servizi offerti.

ha situazione giuridica
type: ObjectProperty
domain: Bene Culturale
range: SituazioneGiuridica
comment: Proprietà che collega un bene alla sua situazione giuridica.

haTipoMisura
type: ObjectProperty
domain: Class
  union of: Bene Culturale
  union of: Bene Naturalistico
range: Tipo misura
comment: Proprietà che lega l'unità di misura al bene culturale che ha realizzato.

ha tipologia biblioteca
type: ObjectProperty
domain: Biblioteca
range: Tipologia biblioteca
comment: Proprietà che lega la biblioteca alla sua tipologia.

ha tipologia ente di appartenenza
type: ObjectProperty
domain: Thing
range: Tipologia ente di appartenenza
comment: Proprietà che lega un soggetto alla tipologia di ente a cui appartiene.

ha tipologia luogo della cultura
type: ObjectProperty
domain: Thing
range: Tipologia luogo cultura
comment: Proprietà che lega un soggetto alla tipologia di luogo della cultura.

ha tipologia museo
type: ObjectProperty
domain: Museo
range: Tipologia museo
comment: Proprietà che lega un museo alla sua tipologia.

haUso
type: ObjectProperty
domain: Bene Culturale
range: Uso
comment: Proprietà che lega il bene ai dettagli sul suo uso.

notizieCronologicheRelative
type: ObjectProperty
domain: Class
  union of: Bene Culturale
  union of: Bene Naturalistico
range: Cronologia
comment: Proprietà che lega un bene culturale alle relative informazioni cronologiche.

haEstremoCronologico
type: ObjectProperty
domain: Notizie storiche
domain: Class
  union of: Bene Culturale
  union of: Bene Naturalistico
range: Notizie storiche
range: Class
  union of: Estremo Cronologico Recente
  union of: Estremo Cronologico Remoto
comment: Proprietà che lega un bene culturale alle relative notizie storiche.
label: notizieStoricheRelative

strutturaDiAppartenenza
type: ObjectProperty
domain: Class
  union of: Bene Culturale
  union of: Bene Naturalistico
range: Struttura somplessa
comment: Proprietà che lega ciascun bene alla sua eventuale struttura complessa di appartenenza.

accessibilitaBiblioteca
type: DatatypeProperty
domain: Biblioteca
range: string
comment: Descrizione dell'accessibilità della biblioteca.

accessibilitaMuseo
type: DatatypeProperty
domain: Museo
range: string
comment: Descrizione dell'accessibilità del museo.

orario di chiusura
type: DatatypeProperty
domain: Orario di apertura
range: Literal
comment: Orario di chiusura.

Altezza max
type: DatatypeProperty
domain: Class
  union of: Bene Culturale
  union of: Bene Naturalistico
range: string
comment: Indica l'altezza massima del bene catalogato.

ambito culturale
type: DatatypeProperty
domain: Bene Culturale
range: string
comment: Si utilizzano definizioni quali: ambito, cultura, periodo, produzione, scuola, manifattura, ecc.; a questi termini si fanno seguire la qualificazione geografica o il nome dell’ambito, della cultura, del periodo, della produzione, della scuola, della manifattura, ecc.

autoritaBiblioteca
type: DatatypeProperty
domain: Biblioteca
range: string
comment: Autorità di riferimento della biblioteca.

blog
type: DatatypeProperty
domain: Contatti
range: string
comment: Blog.

codProjBiblioteca
type: DatatypeProperty
domain: Progetto biblioteca
range: string
comment: Codice del progetto legato alla biblioteca.

codTipBiblioteca
type: DatatypeProperty
domain: Tipologia biblioteca
range: string
comment: Codice della tipologia di biblioteca.

codice
type: DatatypeProperty
domain: Thing
range: Literal
comment: Codice generico.

Codice Autore
type: DatatypeProperty
domain: Autore
range: string
comment: Indica il codice univoco della persona o dell'ente collettivo.

Codice bene
type: DatatypeProperty
domain: Codici
range: string
comment: Codice univoco che indica il numero, composto da otto cifre, assegnato dall’ICCD a ciascun bene catalogato secondo l’ordine progressivo relativo ad una determinata Regione.

codiceBeneComponente
type: DatatypeProperty
domain: Struttura somplessa
range: string
comment: Questo campo viene utilizzato soltanto nel corso di operazioni di revisione di schede pregresse, cartacee e/o informatizzate, per conservare memoria di eventuali codici ICCD soppressi per motivi di diversa natura.

codiceBeneRadice
type: DatatypeProperty
domain: Struttura somplessa
range: string
comment: Indica il codice univoco del bene complesso.

codiceEvento
type: DatatypeProperty
domain: Codici
range: string
comment: Codice univoco identificativo dell'evento culturale, assegnato dal TOSC.

codiceFiscaleMuseo
type: DatatypeProperty
domain: Museo
range: string
comment: Codice fiscale del museo.

codice generico
type: DatatypeProperty
domain: Codici
range: string
comment: Codice generico di un bene. Può essere ad esempio codice interno o codice versione.

codice ISBN
type: DatatypeProperty
domain: Codici
range: string
comment: Codice ISBN di un libro.

codiceInfrastruttura
type: DatatypeProperty
domain: Codici
range: string
comment: Codice univoco identificativo dell'infrastruttura, assegnato dal TOSC.

codiceIstatBiblioteca
type: DatatypeProperty
domain: Biblioteca
range: string
comment: Codice Istat della biblioteca.

codiceIstatComune
type: DatatypeProperty
domain: Comune
range: string
comment: Indica il codice Istat del comune.

codiceRete
type: DatatypeProperty
domain: Rete bibliotecaria
range: string
comment: Codice della rete bibliotecaria.

codiceSbn
type: DatatypeProperty
domain: Biblioteca
range: string
comment: Codice snb della biblioteca.

codice versione
type: DatatypeProperty
domain: Codici
range: string
comment: Codice generico di un bene che ne indica la versione.

Coordinate
type: DatatypeProperty
domain: Geometry
range: Literal
comment: Questa proprietà rappresenta le coordinate geografiche della Geometria.

orario di apertura
type: DatatypeProperty
domain: Orario di apertura
range: Literal
comment: Orario di apertura.

data
type: DatatypeProperty
domain: Thing
range: string
comment: Indicazione di una data generica.

data fine
type: DatatypeProperty
domain: Intervallo termporale
range: Literal
comment: Data fine intervallo.

data inizio
type: DatatypeProperty
domain: Intervallo termporale
range: Literal
comment: Data inizio intervallo.

definizione bene
type: DatatypeProperty
domain: Class
  union of: Bene Culturale
  union of: Bene Naturalistico
range: string
comment: Termine o locuzione che individua il bene culturale/botanico oggetto della scheda in base alla categoria e alla tipologia.

Definizione Scheda Bene
type: DatatypeProperty
domain: Class
  union of: Bene Culturale
  union of: Bene Naturalistico
range: string
comment: Definizione della Tipologia di scheda ICCD di appartenenza (A, RA, OA, BNB, ecc.).

denominazione alternativa bene
type: DatatypeProperty
domain: Class
  union of: Bene Culturale
  union of: Bene Naturalistico
range: string
comment: Indica un eventuale nome alternativo del bene.

denominazione bene
type: DatatypeProperty
domain: Class
  union of: Bene Culturale
  union of: Bene Naturalistico
range: string
comment: Indica il nome storico o tradizionale del bene.

denominazioneContenitore
type: DatatypeProperty
domain: Collocazione specifica
range: string
comment: Indica il nome proprio completo o la denominazione corrente o il titolo del contenitore.

denominazioneStruttura
type: DatatypeProperty
domain: Collocazione specifica
range: string
comment: Nome ufficiale per esteso della struttura conservativa presso la quale è conservato il bene.

descProjBiblioteca
type: DatatypeProperty
domain: Progetto biblioteca
range: string
comment: Descrizione del progetto legato alla biblioteca.

descTipBiblioteca
type: DatatypeProperty
domain: Tipologia biblioteca
range: string
comment: Descrizione della tipologia di biblioteca.

descrizione
type: DatatypeProperty
domain: Thing
range: Literal
comment: Descrizione generica.

descrizioneBene
type: DatatypeProperty
domain: Class
  union of: Bene Culturale
  union of: Bene Naturalistico
range: string
comment: Descrizione generale del bene.

descrizioneDritto
type: DatatypeProperty
domain: Bene Culturale
range: string
comment: Descrizione in forma sintetica della raffigurazione presente al dritto di una moneta.

descrizioneEng
type: DatatypeProperty
domain: Museo
range: string
comment: Descrizione dettagliata del museo in inglese.

descrizioneIta
type: DatatypeProperty
domain: Museo
range: string
comment: Descrizione dettagliata del museo in italiano.

descrizioneMuseo
type: DatatypeProperty
domain: Museo
range: string
comment: Descrizione sintetica del museo.

descrizioneRete
type: DatatypeProperty
domain: Rete bibliotecaria
range: string
comment: Descrizione della rete bibliotecaria.

descrizioneRovescio
type: DatatypeProperty
domain: Bene Culturale
range: string
comment: Descrizione in forma sintetica della raffigurazione presente al rovescio di una moneta.

diametroMax
type: DatatypeProperty
domain: Class
  union of: Bene Culturale
  union of: Bene Naturalistico
range: string
comment: Indica il diametro massimo del bene catalogato.

elementiStrutturali
type: DatatypeProperty
domain: Bene Culturale
range: string
comment: Indica gli elementi strutturali del bene.

email
type: DatatypeProperty
domain: Contatti
range: string
comment: Indirizzo email.

emailPrenotazioni
type: DatatypeProperty
domain: Contatti
range: string
comment: Indirizzo email per le prenotazioni.

emittente
type: DatatypeProperty
domain: Bene Culturale
range: string
comment: Indica i riferimenti ai soggetti emittenti nella forma ufficiale italianizzata, se consuetudinaria, oppure traslitterata in caratteri latini, con eventuali specifiche solo se strettamente necessarie.

facebook
type: DatatypeProperty
domain: Contatti
range: string
comment: Pagina facebook.

Fascia cronologica
type: DatatypeProperty
domain: Class
  union of: Cronologia
  union of: Estremo Cronologico Recente
  union of: Estremo Cronologico Remoto
range: string
comment: Indica il secolo, o l'arco di secoli, oppure un periodo temporale di riferimento del bene culturale.

Fascia cronologica circoscritta
type: DatatypeProperty
sub property of: P82 at some time within
domain: Class
  union of: Cronologia
  union of: Estremo Cronologico Recente
  union of: Estremo Cronologico Remoto
range: string
comment: Fornisce le specifiche che permettono di circoscrivere ulteriormente la proprietà fascia Cronologica.

fax
type: DatatypeProperty
domain: Contatti
range: string
comment: Numero di fax.

faxPrenotazioni
type: DatatypeProperty
domain: Contatti
range: string
comment: Numero di fax dedicato alle prenotazioni.

flagEvento
type: DatatypeProperty
domain: Evento culturale
range: string
comment: Flag in evidenza dell'evento.

flagSedeBiblioteca
type: DatatypeProperty
domain: Evento culturale
range: string
comment: Flag sede biblioteca.

fonte Ambito Culturale
type: DatatypeProperty
domain: Bene Culturale
range: string
comment: Indica la fonte che giustifica la denominazione dell'ambito culturale. Es.: documentazione di archivio, fonte orale

funzione
type: DatatypeProperty
domain: Uso
range: string
comment: Indicare la/e funzione/i che l’oggetto ha o ha avuto.

genere denominazione alternativa bene
type: DatatypeProperty
domain: Class
  union of: Bene Culturale
  union of: Bene Naturalistico
range: string
comment: Indica un eventuale nome alternativo del bene.

giorno di apertura
type: DatatypeProperty
domain: Orario di apertura
range: Literal
comment: Giorno di apertura.

googlePlus
type: DatatypeProperty
domain: Contatti
range: string
comment: GooglePlus.

haComeSoggetto
type: DatatypeProperty
domain: Bene Culturale
range: string
comment: Dati relativi al soggetto del bene secondo le definizioni iconografiche tradizionali.

idBiblioteca
type: DatatypeProperty
domain: Biblioteca
range: string
comment: Codice identificativo univoco della biblioteca.

idMuseo
type: DatatypeProperty
domain: Museo
range: string
comment: Codice identificativo univoco del museo.

identificazione bene
type: DatatypeProperty
domain: Class
  union of: Bene Culturale
  union of: Bene Naturalistico
range: string
comment: Indica la situazione del bene in oggetto, in riferimento a raggruppamenti seriali (elementi della stessa specie) o raggruppamenti di elementi diversi. Esempio: esemplare, serie, collezione, insieme, ecc..

impronta libro
type: DatatypeProperty
domain: Bene Culturale
range: string
comment: L’impronta consiste in una stringa di caratteri, rilevati in pagine e righe prestabilite della pubblicazione, in base ad una specifica normativa.

indicazioni
type: DatatypeProperty
domain: Museo
range: string
comment: Descrizione delle indicazioni per raggiungere il museo.

indirizzoViario
type: DatatypeProperty
domain: Indirizzo
range: string
comment: Indica l'indirizzo viario.

infoBiblioteca
type: DatatypeProperty
domain: Biblioteca
range: string
comment: Descrizione delle informazioni riguardanti la biblioteca.

infoBiglietti
type: DatatypeProperty
domain: Museo
range: string
comment: Descrizione delle informazioni relative al costo del biglietto.

ingombro
type: DatatypeProperty
domain: Class
  union of: Bene Culturale
  union of: Bene Naturalistico
domain: Class
  union of: Documento audio
  union of: Documento video
range: string
comment: Indica il titolo del documento audio o video.
comment: Indica l’ingombro complessivo del bene oggetto della scheda, con riferimento all’area oppure al volume.
label: titolo

instagram
type: DatatypeProperty
domain: Contatti
range: string
comment: Profilo instagram.

interventoAutore
type: DatatypeProperty
domain: Autore
range: string
comment: Indica il ruolo svolto dall’autore (persona singola o ente collettivo) nella realizzazione del bene catalogato (ideazione, costruzione, decorazione, ecc.).

larghezzaMax
type: DatatypeProperty
domain: Class
  union of: Bene Culturale
  union of: Bene Naturalistico
range: string
comment: Indica la larghezza massima del bene catalogato.

lingua
type: DatatypeProperty
domain: Bene Culturale
range: string
comment: lingua del bene culturale (ex nei casi in cui il bene è un documento).

livello
type: DatatypeProperty
domain: Struttura somplessa
range: string
comment: Indica la posizione di ciascuna scheda all'interno del sistema relazionale definito dalla strutturazione complessa (vale 0 nella scheda di insieme, ha valori numerici progressivi 1, 2, 3 ecc. nelle schede delle singole parti).

livello individuazione
type: DatatypeProperty
domain: Bene Culturale
range: string
comment: Indicare la qualità dell’individuazione di un sito, se cioè la sua presenza e la sua consistenza siano verificabili in loco, oppure se siano state supposte sulla scorta di cartografia storica, di documentazone d’archivio o di fonti bibliografiche, ecc.

localitaMuseo
type: DatatypeProperty
domain: Museo
range: string
comment: Nome della località in cui si trova il museo.

lunghezzaMax
type: DatatypeProperty
domain: Class
  union of: Bene Culturale
  union of: Bene Naturalistico
range: string
comment: Indica la lunghezza massima del bene catalogato.

materiale
type: DatatypeProperty
domain: Class
  union of: Bene Culturale
  union of: Bene Naturalistico
range: string
comment: Dati relativi al materiale di esecuzione dell'opera.

modalitaUso
type: DatatypeProperty
domain: Uso
range: string
comment: Indicare come si usa o si usava l’oggetto.

newsletter
type: DatatypeProperty
domain: Contatti
range: string
comment: Newsletter.

nome
type: DatatypeProperty
domain: Thing
range: Literal
comment: Nome generico.

nome autore
type: DatatypeProperty
domain: Autore
range: string
comment: Indica nella forma standardizzata il nome di persona o di ente collettivo.

nomeBiblioteca
type: DatatypeProperty
domain: Biblioteca
range: string
comment: Nome della biblioteca.

nome collaboratore
type: DatatypeProperty
domain: Collaboratore
range: string
comment: Indica nella forma standardizzata il nome di persona o di ente collettivo in quanto collaboratore.

nomeColore
type: DatatypeProperty
domain: Colore
range: string
comment: Colore dell'opera.

nomeComune
type: DatatypeProperty
domain: Comune
range: string
comment: Indica il nome del comune.

nome editore
type: DatatypeProperty
domain: Editore
range: string
comment: Indica nella forma standardizzata il nome di persona o di ente collettivo in quanto editore.

nomeEvento
type: DatatypeProperty
domain: Evento culturale
range: string
comment: Nome dell'evento culturale, espresso nelle diverse lingue disponibili.

nomeInfrastruttura
type: DatatypeProperty
domain: Infrastruttura
range: string
comment: Nome dell'infrastruttura, espresso nelle diverse lingue disponibili.

nomeLocalita
type: DatatypeProperty
domain: Localita
range: string
comment: Indica la località geografica.

nomeLuogoEvento
type: DatatypeProperty
domain: Luogo evento culturale
range: string
comment: Nome del luogo dove si svolge l'evento culturale, espresso nelle diverse lingue disponibili.

nomeMuseo
type: DatatypeProperty
domain: Museo
range: string
comment: Nome del museo.

nomeProvincia
type: DatatypeProperty
domain: Provincia
range: string
comment: Indica il nome della provincia.

nome regione
type: DatatypeProperty
domain: Regione
range: string
comment: Indica il nome della Regione.

nome zecca
type: DatatypeProperty
domain: Bene Culturale
range: string
comment: nome della zecca in caratteri latini, nella forma contemporanea al bene numismatico, se necessario seguito dal nome della coeva partizione territoriale.

nominale bene
type: DatatypeProperty
domain: Bene Culturale
range: string
comment: Indica il nome antico o convenzionale della moneta, se noto, utilizzando ove esistente la versione italiana.

notizia
type: DatatypeProperty
domain: Notizie storiche
range: string
comment: Indicazione estesa della notizia.

notiziaSintetica
type: DatatypeProperty
domain: Notizie storiche
range: string
comment: Indicazione sintetica della notizia. Quando si tratti di notizia che presenti elementi di dubbio si fa seguire un punto interrogativo tra parentesi.

occasione raccolta bene
type: DatatypeProperty
domain: Bene Culturale
range: string
comment: l’occasione o le occasioni in cui il bene rilevato si colloca.

orarioEvento
type: DatatypeProperty
domain: Evento culturale
range: string
comment: Orario dell'evento.

orarioMuseo
type: DatatypeProperty
domain: Museo
range: string
comment: Orario di apertura del museo.

osservazioni
type: DatatypeProperty
domain: Class
  union of: Bene Culturale
  union of: Bene Naturalistico
range: string
comment: Brevi note aggiuntive su notizie storicho-critiche, datazione, attribuzione, iconografia, stato di conservazione o restauri, ecc.,

partitaIvaMuseo
type: DatatypeProperty
domain: Museo
range: string
comment: Partita IVA del museo.

pec
type: DatatypeProperty
domain: Contatti
range: string
comment: Indirizzo di posta elettronica certificata.

peso
type: DatatypeProperty
domain: Class
  union of: Bene Culturale
  union of: Bene Naturalistico
range: string
comment: Indicare il peso (in grammi).

pinterest
type: DatatypeProperty
domain: Contatti
range: string
comment: Pinterest.

url del portale cultura regione Veneto
type: DatatypeProperty
sub property of: page
domain: Thing
range: anyURI
comment: url del portale cultura regione Veneto

qualificazione bene
type: DatatypeProperty
domain: Class
  union of: Bene Culturale
  union of: Bene Naturalistico
range: string
comment: Aggettivo o locuzione che precisa, integra o caratterizza il bene catalogato, dal punto di vista della condizione giuridica, amministrativa o funzionale.

responsabileMuseo
type: DatatypeProperty
domain: Museo
range: string
comment: Persona responsabile del museo.

riferimentoAutore
type: DatatypeProperty
domain: Autore
range: string
comment: Indica il nome scelto, nel caso in cui la realizzazione del bene non sia attribuibile direttamente ad uno specifico autore.

scheda bene
type: DatatypeProperty
domain: Class
  union of: Bene Culturale
  union of: Bene Naturalistico
range: string
comment: Tipologia di scheda ICCD di appartenenza (A, RA, OA, BNB, ecc.).

secolo
type: DatatypeProperty
domain: Class
  union of: Cronologia
  union of: Estremo Cronologico Recente
  union of: Estremo Cronologico Remoto
range: string
comment: Viene indicato il secolo in numeri romani; qualora non si conosca il secolo certo a cui si riferisce la notizia, si deve citare un secolo a cui aggregare la proprietà validità.

serie bene
type: DatatypeProperty
domain: Bene Culturale
range: string
comment: Indica la serie cui il bene catalogato va ricondotto, secondo i criteri specificati di seguito. Le indicazioni entro parentesi sono per memoria.

serviziMuseo
type: DatatypeProperty
domain: Museo
range: string
comment: Elenco dei servizi offerti dal museo.

siglaProvincia
type: DatatypeProperty
domain: Provincia
range: string
comment: Indica la sigla della provincia.

sitoInternet
type: DatatypeProperty
domain: Contatti
range: string
comment: Sito internet.

sitoInternetPrenotazioni
type: DatatypeProperty
domain: Contatti
range: string
comment: Sito internet per le prenotazioni.

spessoreMax
type: DatatypeProperty
domain: Class
  union of: Bene Culturale
  union of: Bene Naturalistico
range: string
comment: Indica lo spessore massimo del bene catalogato.

stadioOpera
type: DatatypeProperty
domain: Bene Culturale
range: string
comment: Rapporto dell'opera in esame con quella da cui è tratta o di cui è uno stadio preparatorio.

statoAttivo
type: DatatypeProperty
domain: Class
  union of: Evento culturale
  union of: Infrastruttura
range: string
comment: Indica se l'entità considerata è attiva.

tecninca
type: DatatypeProperty
domain: Bene Culturale
range: string
comment: Dati relativi alla tecnica di esecuzione dell'opera.

telefono
type: DatatypeProperty
domain: Contatti
range: string
comment: Numero di telefono.

telefonoAlt
type: DatatypeProperty
domain: Contatti
range: string
comment: Numero di telefono alternativo.

telefonoPrenotazioni
type: DatatypeProperty
domain: Contatti
range: string
comment: Numero di telefono dedicato alle prenotazioni.

tipoEvento
type: DatatypeProperty
domain: Evento culturale
range: string
comment: Tipo di evento.

tipo localizzazione
type: DatatypeProperty
domain: Class
  union of: Bene Culturale
  union of: Bene Naturalistico
range: string
comment: Tipo di localizzazione.

Tipologia bene
type: DatatypeProperty
domain: Class
  union of: Bene Culturale
  union of: Bene Naturalistico
range: string
comment: Specifiche relative alla tipologia del bene catalogato.

Unità di misura
type: DatatypeProperty
domain: Tipo misura
range: string
comment: Indica l'unità di misura.

updateBiblioteca
type: DatatypeProperty
domain: Biblioteca
range: dateTime
comment: Data di aggiornamento della biblioteca.

url esterna del bene
type: DatatypeProperty
domain: Bene Culturale
range: anyURI
comment: URL che dereferenzia una url (pagina web) esterna dove sono contenute informazioni sul bene.

urlProjBiblioteca
type: DatatypeProperty
domain: Progetto biblioteca
range: string
comment: URL del progetto legato alla biblioteca.

urlRete
type: DatatypeProperty
domain: Rete bibliotecaria
range: string
comment: URL della rete bibliotecaria.

validita
type: DatatypeProperty
domain: Class
  union of: Estremo Cronologico Recente
  union of: Estremo Cronologico Remoto
range: string
comment: Precisa la relazione cronologica tra la proprietà notiziaSintetica e il secolo.

zipCode
type: DatatypeProperty
domain: Indirizzo
range: string
comment: Indica il CAP associato all'indirizzo.

Agente
type: Class
equivalent class: Agent
comment: Classe che rappresenta un generico agente.

Autore
type: Class
subclass of: E21 Person
comment: Classe degli autori di beni culturali.

Bene Culturale
type: Class
equivalent class: CulturalProperty
comment: Questa classe rappresenta un bene culturale, sia materiale che immateriale.

Bene Naturalistico
type: Class
equivalent class: NaturalHeritage
subclass of: Bene Culturale
subclass of: E19 Physical Object
comment: Classe dei beni culturali naturalistici, botanici e paleontologici.

Biblioteca
type: Class
subclass of: Library
comment: Classe delle biblioteche

Codici
type: Class
subclass of: E42 Identifier
comment: Classe che rappresenta l'insieme dei codici.

Collaboratore
type: Class
subclass of: E21 Person
comment: Classe dei collaboratori degli autori di beni culturali.

Collana Editoriale
type: Class
comment: Classe delle collane editoriali.

Collocazione specifica
type: Class
subclass of: E53 Place
comment: Classe della collocazione specifica in cui è conservato il bene.

Colore
type: Class
subclass of: E26 Physical Feature
comment: Classe dei colori.

Comune
type: Class
subclass of: E53 Place
subclass of: City
comment: Classe dei comuni.

Situazione giuridica
type: Class
equivalent class: LegalSituation
comment: Informazioni relative all'attuale proprietà o detenzione del bene catalogato. La compilazione del campo è obbligatoria.

Contatti
type: Class
comment: Classe dei contatti (numeri telefonici, indirizzi email, siti web, etc.).

Cronologia
type: Class
subclass of: E52 Time-Span
comment: Classe delle notizie cronologiche relative ai beni culturali catalogati.

Documento audio
type: Class
comment: Classe dei documenti audio.

Documento video
type: Class
comment: Classe dei documenti video.

Editore
type: Class
subclass of: E21 Person
comment: Classe degli editori di beni culturali.

Estremo Cronologico Recente
type: Class
comment: Classe dell'estremo finale del periodo di tempo in cui si colloca la notizia relativa ai beni culturali catalogati.

Estremo Cronologico Remoto
type: Class
comment: Classe con l'indicazione del momento iniziale del periodo di tempo in cui si colloca la notizia relativa ai beni culturali catalogati

Evento culturale
type: Class
subclass of: CulturalEvent
subclass of: E5 Event
comment: Classe degli eventi culturali e degli spettacoli.

Geometria
type: Class
equivalent class: Geometry
comment: Questa classe rappresenta la geometria associabile a un'entità spaziale.

Indirizzo
type: Class
equivalent class: Address
subclass of: Address
comment: Classe degli indirizzi.

Infrastruttura
type: Class
comment: Classe delle infrastrutture secondo TOSC.

Intervallo termporale
type: Class
subclass of: TimeInterval
comment: Classe intervallo temporale.

Libro
type: Class
subclass of: Bene Culturale
comment: Classe dei libri.

Localita
type: Class
subclass of: E53 Place
subclass of: Locality
comment: Classe delle località geografiche.

Luogo evento culturale
type: Class
subclass of: E53 Place
comment: Classe dei luoghi degli eventi culturali.

Museo
type: Class
subclass of: Museum
comment: Classe dei musei.

Nome collocazione specifica
type: Class
subclass of: E44 Place Appellation
comment: Classe delle denominazioni della collocazione specifica in cui è conservato il bene.

Notizie storiche
type: Class
comment: Classe delle notizie storiche relative ai beni culturali catalogati.

Orario di apertura
type: Class
comment: Classe dell'orario di aperturae l'orario di accesso.

Progetto biblioteca
type: Class
comment: Classe dei progetti legati alle biblioteche

Provincia
type: Class
subclass of: E53 Place
subclass of: Province
comment: Classe delle province.

Regione
type: Class
subclass of: E53 Place
subclass of: Region
comment: Classe delle regioni.

Rete bibliotecaria
type: Class
comment: Classe delle reti bibliotecarie

Servizio
type: Class
comment: Classe dei servizi.

Struttura somplessa
type: Class
comment: Classe relativa a beni culturali complessi, che indica la posizione di ciascuna scheda all'interno del sistema relazionale definito dalla strutturazione complessa.

Teatro
type: Class
equivalent class: Theatre
comment: Classe dei teatri.

Tipo geometria
type: Class
equivalent class: GeometryType
comment: Questa classe rappresenta l'insieme delle tipologia di geometria.

Tipo misura
type: Class
subclass of: E16 Measurement
comment: Classe delle unità di misura.

Tipologia biblioteca
type: Class
comment: Classe delle tipologie di biblioteche

Tipologia ente di appartenenza
type: Class
comment: Classe delle tipologie diente di appartenenza

Tipologia luogo cultura
type: Class
comment: Classe delle tipologie di luogo della cultura

Tipologia museo
type: Class
comment: Classe delle tipologie di museo

Uso
type: Class
comment: Classe dei dati relativi all’utilizzazione attuale o passata del bene.

Villa
type: Class
subclass of: Bene Culturale
subclass of: CulturalProperty
comment: Classe dei beni culturali di tipo villa.