Definizione Scheda Bene
range: string
domain: Class
  union of: BeneNaturalistico
  union of: BeneCulturale
comment: Definizione della Tipologia di scheda ICCD di appartenenza (A, RA, OA, BNB, ecc.).
type: DatatypeProperty