Definizione Scheda Bene
type: DatatypeProperty
comment: Definizione della Tipologia di scheda ICCD di appartenenza (A, RA, OA, BNB, ecc.).
domain: Class
  union of: BeneNaturalistico
  union of: BeneCulturale
range: string