haCodiceBene
sub property of: P48 has preferred identifier
range: Codici
domain: Class
  union of: BeneNaturalistico
  union of: BeneCulturale
comment: Proprietà che lega il bene catalogato al relativo codice univoco.
type: ObjectProperty