haCodiceBene
type: ObjectProperty
comment: Proprietà che lega il bene catalogato al relativo codice univoco.
domain: Class
  union of: BeneNaturalistico
  union of: BeneCulturale
range: Codici
sub property of: P48 has preferred identifier