ha geometria
type: ObjectProperty
comment: Proprietà che collega una qualsisasi cosa alla sua geometria.
comment: Proprietà che collega la geometria al suo tipo (poligono, punto, linea).
domain: Thing
domain: Geometria
label: ha tipo geometria
range: TipoGeometria
range: Geometria
equivalent property: hasGeometry
equivalent property: hasGeometryType