ha situazione giuridica
equivalent property: hasLegalSituation
range: SituazioneGiuridica
domain: BeneCulturale
comment: Proprietà che collega un bene alla sua situazione giuridica.
type: ObjectProperty