Bene Naturalistico
type: Class
comment: Classe dei beni culturali naturalistici, botanici e paleontologici.
subclass of: BeneCulturale
subclass of: E19 Physical Object
equivalent class: NaturalHeritage